{"text_format":"1","workbook":"xlsx","n_sheets":3,"sheets":["Test File","Sheet1","Conversion Factors"],"not_rendered":{"charts":0,"images":0,"macros":0,"external_links":1,"defined_names":3,"comments":0,"pivot_tables":0},"unopened":[],"bounds":{"document_bytes":16777216,"sheet_cells":100000,"rows_first":2000,"rows_last":500,"rows_between":2000,"halvings":0,"cell_chars":16384,"cell_head_chars":4096},"cells_cut":0,"cells_raw":0,"read":"whole","date_system":"1900"}

{"sheet":"Test File","index":0,"n_rows":55,"n_cols":69,"rows_kept":55,"cut":false,"hidden":false,"merged":[[51,10,53,22],[54,10,56,22],[11,29,11,30],[10,40,10,46],[49,14,49,22],[48,14,48,19],[10,22,10,23],[42,0,42,2],[43,0,43,2],[44,0,44,2],[45,8,45,13],[47,14,47,22],[41,0,41,2],[30,0,30,2],[31,0,31,2],[32,0,32,2],[33,0,33,2],[34,0,34,2],[35,0,35,2],[36,0,36,2],[37,0,37,2],[38,0,38,2],[39,0,39,2],[40,0,40,2],[29,0,29,2],[10,0,10,3],[10,4,10,5],[10,6,10,17],[16,0,16,2],[23,0,23,2],[18,0,18,2],[19,0,19,2],[20,0,20,2],[21,0,21,2],[22,0,22,2],[12,0,12,3],[13,0,13,2],[14,0,14,2],[15,0,15,2],[28,0,28,2],[17,0,17,2],[24,0,24,2],[25,0,25,2],[26,0,26,2],[27,0,27,2],[0,0,0,22],[1,0,1,22],[3,0,3,23],[5,2,5,7],[5,8,5,13],[5,14,5,19],[11,0,11,2],[6,2,6,7],[6,8,6,13],[6,14,6,19],[7,2,7,7],[7,8,7,13],[7,14,7,19],[10,18,10,21]]}
["Mississippi State University"]
["Non-Exempt Employee Semi-Monthly Time Report"]
[]
["Instructions:  The Fair Labor Standards Act requires that a record of hours worked on a weekly basis be maintained for all employees except executive, administrative, managerial, faculty, and professional (non-faculty).  Department/unit heads are responsible for compiling and maintaining this record in department files on each covered employee for a period of at least (3) years."]
[]
["MSU ID #:",null,null,null,null,null,null,null,"Pay period start date:",null,null,null,null,null,"2018-07-01",null,null,null,null,null,null,null,null,null,null,{"$f":"TEXT(O6,\"dddd\")","v":"Sunday"},null,null,null,"Please Select"]
["Name:",null,null,null,null,null,null,null,"Pay period end date:",null,null,null,null,null,"2019-07-28",null,null,null,null,null,null,null,null,null,null,null,null,null,null,"No"]
["Department:",null,null,null,null,null,null,null,"Pay Period Number:",null,null,null,null,null,13,null,null,null,null,null,null,null,null,null,null,null,null,null,null,"Yes"]
[]
[]
["Employee Scheduled Hours Per Week",null,null,null,40,null,"FIELDS MUST BE ENTERED FOR CALULATIONS TO WORK PROPERLY",null,null,null,null,null,null,null,null,null,null,null,"Receive Compensatory Time",null,null,null,"Yes",null,null,null,null,null,null,null,null,null,null,null,"Over 40",null,null,null,null,null,"HOW ANALYSIS"]
["Work Week Dates",null,null,"Day of The Week","Actual Hours Worked","Compensatory Time Used","Holiday","Medical Leave","Personal Leave","Actual Wrk Hrs During  Admin Close Period","Administrative Closing/Leave Period","Jury Duty","Military Leave","Leave Without Pay","Totals","DOC-Payroll Conversion","RTO","RTO-Payroll Conversion","Overtime Hours","Hours Transferred to Comp. Record","HOW-Holiday Pay or Admin/Leave Closing","HOT-Holiday Pay","SST-Payroll","Conversion Factor",null,8,"DOC","RTO",null,"SST",null,null,null,"Cumm Actual HRS",40,"Administrative Leave","HOW-Holiday Pay","Comp. Time","Administrative/Schedule",null,"Holiday=0\n1",2,3,4,null,"<=40\n5",null,"HOT Workup","HOT-Holiday Pay (HOLIDAY PAY)",null,"HOT-Administrative HRS","Administrative=0\n1",2,3,4,null,"<=40\n5",null,null,"Holiday Flag","Up to 40","How","Hot","Actual Hours Worked","Admin Flag","Admin","Admin HOW","Admin OVT"]
["Hours-Previous WK (Due to Split WK)",null,null,null,null,null,null,null,null,null,null,null,null,null,null,null,null,null,null,null,null,null,null,null,null,null,null,null,null,null,null,null,null,null,null,{"$f":"IF(AND(AM13=0,J13=0),AM13,IF(AND(E13>AM13,J13=0),J13,IF(AND(J13<AM13,AI13=0),J13,IF(AND(AM13=J13,AI13<AM13),AM13-AI13,IF(AND(J13=AM13,AI13=AM13),AI13,IF(AND(J13<AM13,AI13>0),AM13-J13,IF(AND(AM13>J13,AI13<E13),E13-AI13,IF(AND(E13>AM13,AI13=E13),O13-AI13,0))))))))","v":0},{"$f":"IF(AND(G13=0,E13>G13),G13,IF(AND(E13>G13,AI13=0),G13,IF(AND(E13<G13,AI13=0),E13,IF(AND(E13=G13,AI13<G13),G13-AI13,IF(AND(E13=G13,AI13=G13),AI13,IF(AND(E13<G13,AI13>0),G13-E13,IF(AND(E13>G13,AI13<E13),E13-AI13,IF(AND(E13>G13,AI13=E13),O13-AI13,0))))))))","v":0},null,{"$f":"K13","v":0}]
[{"$f":"IF(EXACT(D14,$Z$6)=TRUE,$O$6,IF(A12=0,\"\",IF(A12<$O$7,A12+1,IF(A12=$O$7,\"\"))))","v":"2018-07-01"},null,null,"Sunday",null,null,null,null,null,null,null,null,null,null,{"$f":"SUM(E14:N14)-J14","v":0},{"$f":"IF(AND(ISNUMBER(AA14),ISNUMBER(X14)),AA14*X14,\"\")","v":""},null,{"$f":"IF(AND(ISNUMBER(AB14),ISNUMBER(X14)),AB14*X14,\"\")","v":""},null,null,{"$f":"IF(BJ14>0,BJ14,BN14)","v":0},{"$f":"IF(BK14>0,BK14,0)","v":0},null,{"$f":"IF(ISNA(INDEX('Conversion Factors'!$B$6:$B$374,MATCH('Test File'!$A$14:$A$44,'Conversion Factors'!$A$6:$A$374,0))),\"\",INDEX('Conversion Factors'!$B$6:$B$374,MATCH('Test File'!$A$14:$A$44,'Conversion Factors'!$A$6:$A$374,0)))","v":""},null,{"$f":"A14","v":"2018-07-01"},{"$f":"IF(AND(ISNUMBER(N14),ISNUMBER($Z$12)),N14/$Z$12,\"\")","v":""},{"$f":"IF(AND(ISNUMBER(Q14),ISNUMBER($Z$12)),Q14/$Z$12,\"\")","v":""},null,null,null,null,null,{"$f":"E14","v":0},{"$f":"IF(AH14>$AI$12,AH14-$AI$12,0)","v":0},{"$f":"IF(AND(AZ14>0,AZ14),IF(BA14>0,BA14,IF(BB14>0,BB14,IF(BC14>0,BC14,IF(BF14>0,BF14,\"\")))))","v":false},{"$f":"IF(AND(AO14>0,AO14),IF(AP14>0,AP14,IF(AQ14>0,AQ14,IF(AR14>0,AR14,IF(AU14>0,AU14,\"\")))))","v":false},null,{"$f":"J14","v":0},null,{"$f":"IF(G14=0,0,\"\")","v":0},{"$f":"IF(AND(AH14<=40,E14=G14),G14,0)","v":0},{"$f":"IF(AND(AH14<=40,E14>=G14,G14>0),O14-E14,0)","v":0},{"$f":"IF(AND(AH14<=40,E14<G14),O14-G14,0)","v":0},{"$f":"IF(AND(G14=0),G14,IF(AND(G14>0,AI14>0,G14=AT14),AT14,IF(AND(G14>0,AI14>0,G14-AT14),AT14,0)))","v":0},null,{"$f":"AS14","v":0},{"$f":"IF(AND(AH13+AU14=40,AI14>0,AI14>AU14),AI14-AU14,IF(AND(AH13+AU14=40,AI14>0,AI14<AU14,AU14+AI14=G14),AI14,IF(AND(AH13>40,AH14>40,G14=AI14),AI14,0)))","v":0},{"$f":"AV14","v":0},null,{"$f":"IF(AND(J14>0,AI14>=J14,BB14=0),O14-AI14,IF(AND(J14>0,AI14>0,BB14<=AI14),AI14-BB14,IF(AND(J14>0,AI14>0,BB14>AI14),J14-BB14,0)))","v":0},{"$f":"IF(J14=0,0,\"\")","v":0},{"$f":"IF(AND(AH14<=40,E14=J14),J14,0)","v":0},{"$f":"IF(AND(AZ14=0),AZ14,IF(AND(AH14>40,E14>=J14),BE14,IF(AND(AH14<=40,E14>J14),J14,0)))","v":0},{"$f":"IF(AND(AH14<=40,E14<J14),O14-J14,0)","v":0},{"$f":"IF(AND(J14=0),J14,IF(AND(J14>0,AI14>0,J14=BC14),BC14,IF(AND(J14>0,AI14>0,J14-BC14),BC14,0)))","v":0},null,{"$f":"BD14","v":0},null,{"$f":"IF(AND(G14>0,E14>0),1,0)","v":0},{"$f":"40-AH14","v":40},{"$f":"IF(AND(BH14=1,40-BL13>0,40-BL13<8),40-BL13,IF(AND(E14<G14),E14,G14))","v":0},{"$f":"IF(AND(BH14=1,BL14>40,E14<G14),E14-BJ14,(IF(AND(BH14=1,BL14>0,E14>=G14),G14-BJ14,0)))","v":0},{"$f":"SUM(E13:E14)","v":0},{"$f":"IF(AND(K14>0,E14>0),1,0)","v":0},{"$f":"IF(AND(BM14=1,J14>8),K14,(IF(AND(BM14=1,J14>0),J14,0)))","v":0},{"$f":"IF(AND(BM14=1,40-BL13>0,40-BL13<8),40-BL13,IF(AND(J14<K14),J14,K14))","v":0},{"$f":"IF(AND(BM14=1,BL14>40,J14<=K14),J14-BO14,IF(AND(BM14=1,BL14>0,J14>K14),K14-BO14,0))","v":0}]
[{"$f":"IF(EXACT(D15,$Z$6)=TRUE,$O$6,IF(A14=0,\"\",IF(A14<$O$7,A14+1,IF(A14=$O$7,\"\"))))","v":"2018-07-02"},null,null,"Monday",null,null,null,null,null,0,null,null,null,null,{"$f":"SUM(E15:N15)-J15","v":0},{"$f":"IF(AND(ISNUMBER(AA15),ISNUMBER(X15)),AA15*X15,\"\")","v":""},null,{"$f":"IF(AND(ISNUMBER(AB15),ISNUMBER(X15)),AB15*X15,\"\")","v":""},null,null,{"$f":"IF(BJ15>0,BJ15,BN15)","v":0},{"$f":"IF(BK15>0,BK15,0)","v":0},null,{"$f":"IF(ISNA(INDEX('Conversion Factors'!$B$6:$B$374,MATCH('Test File'!$A$14:$A$44,'Conversion Factors'!$A$6:$A$374,0))),\"\",INDEX('Conversion Factors'!$B$6:$B$374,MATCH('Test File'!$A$14:$A$44,'Conversion Factors'!$A$6:$A$374,0)))","v":""},null,"2018-07-02","","",null,null,null,null,null,{"$f":"E15+AH14","v":0},{"$f":"IF(AH15>$AI$12,AH15-($AI$12+AI14),0)","v":0},{"$f":"IF(AND(AZ15>0,AZ15),IF(BA15>0,BA15,IF(BB15>0,BB15,IF(BC15>0,BC15,IF(BF15>0,BF15,\"\")))))","v":false},{"$f":"IF(AND(AO15>0,AO15),IF(AP15>0,AP15,IF(AQ15>0,AQ15,IF(AR15>0,AR15,IF(AU15>0,AU15,0)))))","v":false},null,0,null,0,0,0,0,0,{"$f":"IF(AND(AH14<=40),40-AH14,0)","v":40},{"$f":"AS15","v":0},0,{"$f":"AV15","v":0},null,0,0,0,0,0,0,{"$f":"IF(AND(AH14<=40),40-AH14,0)","v":40},{"$f":"BD15","v":0},null,{"$f":"IF(AND(G15>0,E15>0),1,0)","v":0},40,0,0,{"$f":"SUM(E13:E15)","v":0},{"$f":"IF(AND(K15>0,E15>0),1,0)","v":0},{"$f":"IF(AND(BM15=1,J15>8),K15,(IF(AND(BM15=1,J15>0),J15,0)))","v":0},0,0]
["2018-07-03",null,null,"Tuesday",null,null,null,null,null,0,null,null,null,null,{"$f":"SUM(E16:N16)-J16","v":0},"",null,"",null,null,{"$f":"IF(BJ16>0,BJ16,BN16)","v":0},0,null,{"$f":"IF(ISNA(INDEX('Conversion Factors'!$B$6:$B$374,MATCH('Test File'!$A$14:$A$44,'Conversion Factors'!$A$6:$A$374,0))),\"\",INDEX('Conversion Factors'!$B$6:$B$374,MATCH('Test File'!$A$14:$A$44,'Conversion Factors'!$A$6:$A$374,0)))","v":""},null,"2018-07-03","","",null,null,null,null,null,0,{"$f":"IF(AH16>$AI$12,AH16-($AI$12+AI15+AI14),0)","v":0},false,false,null,0,null,0,0,0,0,0,40,0,0,0,null,0,0,0,0,0,0,{"$f":"IF(AND(AH15<=40),40-AH15,0)","v":40},0,null,{"$f":"IF(AND(G16>0,E16>0),1,0)","v":0},40,0,0,{"$f":"SUM(E13:E16)","v":0},0,{"$f":"IF(AND(BM16=1,J16>8),K16,(IF(AND(BM16=1,J16>0),J16,0)))","v":0},{"$f":"IF(AND(BM16=1,40-BL15>0,40-BL15<8),40-BL15,IF(AND(J16<K16),J16,K16))","v":0},0]
["2018-07-04",null,null,"Wednesday",null,null,null,null,null,0,null,null,null,null,0,"",null,"",null,null,0,0,null,{"$f":"IF(ISNA(INDEX('Conversion Factors'!$B$6:$B$374,MATCH('Test File'!$A$14:$A$44,'Conversion Factors'!$A$6:$A$374,0))),\"\",INDEX('Conversion Factors'!$B$6:$B$374,MATCH('Test File'!$A$14:$A$44,'Conversion Factors'!$A$6:$A$374,0)))","v":""},null,"2018-07-04","","",null,null,null,null,null,0,{"$f":"IF(AH17>$AI$12,AH17-($AI$12+AI16+AI15+AI14),0)","v":0},false,false,null,0,null,0,0,0,0,0,40,0,0,0,null,0,0,0,0,0,0,40,0,null,0,40,0,0,{"$f":"SUM(E13:E17)","v":0},0,{"$f":"IF(AND(BM17=1,J17>8),K17,(IF(AND(BM17=1,J17>0),J17,0)))","v":0},{"$f":"IF(AND(BM17=1,40-BL16>0,40-BL16<8),40-BL16,IF(AND(J17<K17),J17,K17))","v":0},0]
["2018-07-05",null,null,"Thursday",null,null,null,null,null,0,null,null,null,null,0,"",null,"",null,null,0,0,null,{"$f":"IF(ISNA(INDEX('Conversion Factors'!$B$6:$B$374,MATCH('Test File'!$A$14:$A$44,'Conversion Factors'!$A$6:$A$374,0))),\"\",INDEX('Conversion Factors'!$B$6:$B$374,MATCH('Test File'!$A$14:$A$44,'Conversion Factors'!$A$6:$A$374,0)))","v":""},null,"2018-07-05","","",null,null,null,null,null,0,{"$f":"IF(AH18>$AI$12,AH18-($AI$12+AI17+AI16+AI15+AI14),0)","v":0},false,false,null,0,null,0,0,0,0,0,{"$f":"IF(AND(AH17<=40),40-AH17,0)","v":40},0,0,0,null,0,0,0,0,0,0,40,0,null,0,40,0,0,{"$f":"SUM(E13:E18)","v":0},0,0,0,0]
["2018-07-06",null,null,"Friday",null,null,null,null,null,0,null,null,null,null,0,"",null,"",null,null,0,0,null,{"$f":"IF(ISNA(INDEX('Conversion Factors'!$B$6:$B$374,MATCH('Test File'!$A$14:$A$44,'Conversion Factors'!$A$6:$A$374,0))),\"\",INDEX('Conversion Factors'!$B$6:$B$374,MATCH('Test File'!$A$14:$A$44,'Conversion Factors'!$A$6:$A$374,0)))","v":""},null,"2018-07-06","","",null,null,null,null,null,0,{"$f":"IF(AH19>$AI$12,AH19-($AI$12+AI18+AI17+AI16+AI15+AI14),0)","v":0},false,false,null,0,null,0,0,0,0,0,{"$f":"IF(AND(AH18<=40),40-AH18,0)","v":40},0,0,0,null,0,0,0,0,0,0,40,0,null,0,40,0,0,{"$f":"SUM(E13:E19)","v":0},0,0,0,{"$f":"IF(AND(BM19=1,BL19>40,J19<=K19),J19-BO19,IF(AND(BM19=1,BL19>0,J19>K19),K19-BO19,0))","v":0}]
["2018-07-07",null,null,"Saturday",0,null,null,null,null,null,null,null,null,null,{"$f":"SUM(E20:N20)-J20","v":0},"",null,"",null,null,0,0,null,{"$f":"IF(ISNA(INDEX('Conversion Factors'!$B$6:$B$374,MATCH('Test File'!$A$14:$A$44,'Conversion Factors'!$A$6:$A$374,0))),\"\",INDEX('Conversion Factors'!$B$6:$B$374,MATCH('Test File'!$A$14:$A$44,'Conversion Factors'!$A$6:$A$374,0)))","v":""},null,"2018-07-07","","",null,null,null,null,null,0,{"$f":"IF(AH20>$AI$12,AH20-($AI$12+AI19+AI18+AI17+AI16+AI15+AI14),0)","v":0},false,false,null,0,null,0,0,0,0,0,40,0,0,0,null,0,0,0,0,0,0,40,0,null,0,40,0,0,{"$f":"SUM(E13:E20)","v":0},0,0,0,{"$f":"IF(AND(BM20=1,BL20>40,J20<=K20),J20-BO20,IF(AND(BM20=1,BL20>0,J20>K20),K20-BO20,0))","v":0}]
{"$rows_left_out":36}
{"sheet":"Sheet1","index":1,"n_rows":0,"n_cols":0,"rows_kept":0,"cut":false,"hidden":true,"merged":[]}

{"sheet":"Conversion Factors","index":2,"n_rows":377,"n_cols":2,"rows_kept":377,"cut":false,"hidden":true,"merged":[]}
["Pay period start date:",{"$f":"'[1]Conversion Factors'!$B$1","v":"2019-07-01"}]
[]
["Pay period end date:",{"$f":"'[1]Conversion Factors'!$B$3","v":"2020-06-30"}]
[]
["Payroll Dates","Conversion Factor"]
[{"$f":"'[1]Conversion Factors'!A6","v":"2019-07-01"},{"$f":"'[1]Conversion Factors'!B6","v":7.8789999999999996}]
[{"$f":"'[1]Conversion Factors'!A7","v":"2019-07-02"},{"$f":"'[1]Conversion Factors'!B7","v":7.8789999999999996}]
[{"$f":"'[1]Conversion Factors'!A8","v":"2019-07-03"},{"$f":"'[1]Conversion Factors'!B8","v":7.8789999999999996}]
[{"$f":"'[1]Conversion Factors'!A9","v":"2019-07-04"},{"$f":"'[1]Conversion Factors'!B9","v":7.8789999999999996}]
[{"$f":"'[1]Conversion Factors'!A10","v":"2019-07-05"},{"$f":"'[1]Conversion Factors'!B10","v":7.8789999999999996}]
[{"$f":"'[1]Conversion Factors'!A11","v":"2019-07-06"},{"$f":"'[1]Conversion Factors'!B11","v":7.8789999999999996}]
[{"$f":"'[1]Conversion Factors'!A12","v":"2019-07-07"},{"$f":"'[1]Conversion Factors'!B12","v":7.8789999999999996}]
[{"$f":"'[1]Conversion Factors'!A13","v":"2019-07-08"},{"$f":"'[1]Conversion Factors'!B13","v":7.8789999999999996}]
[{"$f":"'[1]Conversion Factors'!A14","v":"2019-07-09"},{"$f":"'[1]Conversion Factors'!B14","v":7.8789999999999996}]
[{"$f":"'[1]Conversion Factors'!A15","v":"2019-07-10"},{"$f":"'[1]Conversion Factors'!B15","v":7.8789999999999996}]
[{"$f":"'[1]Conversion Factors'!A16","v":"2019-07-11"},{"$f":"'[1]Conversion Factors'!B16","v":7.8789999999999996}]
[{"$f":"'[1]Conversion Factors'!A17","v":"2019-07-12"},{"$f":"'[1]Conversion Factors'!B17","v":7.8789999999999996}]
[{"$f":"'[1]Conversion Factors'!A18","v":"2019-07-13"},{"$f":"'[1]Conversion Factors'!B18","v":7.8789999999999996}]
[{"$f":"'[1]Conversion Factors'!A19","v":"2019-07-14"},{"$f":"'[1]Conversion Factors'!B19","v":7.8789999999999996}]
[{"$f":"'[1]Conversion Factors'!A20","v":"2019-07-15"},{"$f":"'[1]Conversion Factors'!B20","v":7.8789999999999996}]
{"$rows_left_out":357}